{"text_format":"1","workbook":"xlsx","n_sheets":3,"sheets":["STUDY DETAILS","CTU ORDER FORM","DATA-DO NOT DELETE"],"not_rendered":{"charts":0,"images":1,"macros":1,"external_links":2,"defined_names":11,"comments":0,"pivot_tables":0},"unopened":[],"bounds":{"document_bytes":16777216,"sheet_cells":100000,"rows_first":2000,"rows_last":500,"rows_between":2000,"halvings":0,"cell_chars":16384,"cell_head_chars":4096},"cells_cut":0,"cells_raw":0,"read":"whole","date_system":"1900"}

{"sheet":"STUDY DETAILS","index":0,"n_rows":18,"n_cols":1,"rows_kept":18,"cut":false,"hidden":false,"merged":[[23,0,23,9],[24,0,24,9],[18,0,18,9],[19,0,19,9],[20,0,20,9],[21,0,21,9],[22,0,22,9],[1,0,1,9],[13,0,13,1],[13,2,13,3],[14,0,14,1],[14,2,14,3],[10,0,10,1],[10,2,10,3],[11,0,11,1],[11,2,11,3],[12,0,12,1],[12,2,12,3],[7,0,7,1],[7,2,7,3],[8,0,8,1],[8,2,8,3],[9,0,9,1],[9,2,9,3],[4,0,4,1],[4,2,4,3],[5,0,5,1],[5,2,5,3],[6,0,6,1],[6,2,6,3]]}
["CLINICAL TRIALS UNIT (CTU) SERVICES ORDER FORM"]
["Instructions: To request CTU services, please complete this order form and upload along with your application in OnCore - Protocols Tab>PC Console>Documents/Info>Attachments>Updated>Add"]
["For assistance, contact ctu@sc-ctsi.org or 323-865-3056."]
[]
["Submission Date:"]
["OnCore Protocol Number:"]
["IRB Number (if available):"]
["PI Name (Last, First):"]
["PI Department:"]
["Study Type:"]
["Lab Only (Y/N):"]
["Arm/Segment/Cohort Name: "]
["Is this an amendment after study activation by CTO:"]
["Protocol Version Date:"]
["Laboratory Manual Version Date: "]
[]
[]
["Study Team Comments/Notes:"]

{"sheet":"CTU ORDER FORM","index":1,"n_rows":82,"n_cols":27,"rows_kept":82,"cut":false,"hidden":false,"merged":[[2,26,3,26],[2,11,2,12],[2,13,2,14],[2,15,2,16],[2,17,2,18],[2,23,2,24],[2,21,2,22],[2,19,2,20],[70,0,70,2],[29,0,29,1],[58,0,58,2],[12,0,12,1],[17,0,17,1],[22,0,22,1],[24,0,24,1],[39,0,39,1],[2,7,2,8],[2,9,2,10],[2,5,2,6],[2,3,2,4],[67,0,67,2]]}
[null,null,null,"PLEASE LIST THE SERVICES NEEDED PER VISIT FOR EACH PATIENT FOR YOUR STUDY",null,null,null,null,null,null,null,null,null,null,null,null,null,null,null,null,null,null,null,null,null,"hold"]
[{"$f":"MATCH(\"hold\",1:1,0)","v":26}]
[{"$f":"SUBSTITUTE(ADDRESS(1,A2,4),1,\"\")&\":\"&SUBSTITUTE(ADDRESS(1,A2,4),1,\"\")","v":"Z:Z"},{"$f":"SUBSTITUTE(ADDRESS(1,A2-2,4),1,\"\")&\":\"&SUBSTITUTE(ADDRESS(1,A2-1,4),1,\"\")","v":"X:Y"},null,"VISIT NAME?",null,"VISIT NAME?",null,"VISIT NAME?",null,"VISIT NAME?",null,"VISIT NAME?",null,"VISIT NAME?",null,"VISIT NAME?",null,"VISIT NAME?",null,"VISIT NAME?",null,"VISIT NAME?",null,"VISIT NAME?",null,null,"TOTAL COST PER SERVICE"]
["A. COMMON CLINICAL PROCEDURES",null,"PRICE","Qty/Freq","Total","Qty/Freq","Total","Qty/Freq","Total","Qty/Freq","Total","Qty/Freq","Total","Qty/Freq","Total","Qty/Freq","Total","Qty/Freq","Total","Qty/Freq","Total","Qty/Freq","Total","Qty/Freq","Total"]
["CTU-101","Vital signs",6,null,{"$f":"$C$5*D5","v":0},null,{"$f":"$C$5*F5","v":0},null,{"$f":"$C$5*H5","v":0},null,{"$f":"$C$5*J5","v":0},null,{"$f":"$C$5*L5","v":0},null,{"$f":"$C$5*N5","v":0},null,{"$f":"$C$5*P5","v":0},null,{"$f":"$C$5*R5","v":0},null,{"$f":"$C$5*T5","v":0},null,{"$f":"$C$5*V5","v":0},null,{"$f":"$C$5*X5","v":0},null,{"$f":"SUMPRODUCT(D5:Z5*MOD(COLUMN(D5:Z5)-COLUMN(E5)+1,2))","v":0}]
["CTU-102","Height/Weight/BSA",6,null,{"$f":"$C$6*D6","v":0},null,{"$f":"$C$6*F6","v":0},null,{"$f":"$C$6*H6","v":0},null,{"$f":"$C$6*J6","v":0},null,{"$f":"$C$6*L6","v":0},null,{"$f":"$C$6*N6","v":0},null,{"$f":"$C$6*P6","v":0},null,{"$f":"$C$6*R6","v":0},null,{"$f":"$C$6*T6","v":0},null,{"$f":"$C$6*V6","v":0},null,{"$f":"$C$6*X6","v":0},null,{"$f":"SUMPRODUCT(D6:Z6*MOD(COLUMN(D6:Z6)-COLUMN(E6)+1,2))","v":0}]
["CTU-103","Direct Venipuncture",12,null,{"$f":"$C$7*D7","v":0},null,{"$f":"$C$7*F7","v":0},null,{"$f":"$C$7*H7","v":0},null,{"$f":"$C$7*J7","v":0},null,{"$f":"$C$7*L7","v":0},null,{"$f":"$C$7*N7","v":0},null,{"$f":"$C$7*P7","v":0},null,{"$f":"$C$7*R7","v":0},null,{"$f":"$C$7*T7","v":0},null,{"$f":"$C$7*V7","v":0},null,{"$f":"$C$7*X7","v":0},null,0]
["CTU-104","Blood Draw by Intravenous (IV): First draw, includes IV placement time  and initial tube",36,null,{"$f":"$C$8*D8","v":0},null,{"$f":"$C$8*F8","v":0},null,{"$f":"$C$8*H8","v":0},null,{"$f":"$C$8*J8","v":0},null,{"$f":"$C$8*L8","v":0},null,{"$f":"$C$8*N8","v":0},null,{"$f":"$C$8*P8","v":0},null,{"$f":"$C$8*R8","v":0},null,{"$f":"$C$8*T8","v":0},null,{"$f":"$C$8*V8","v":0},null,{"$f":"$C$8*X8","v":0},null,0]
["CTU-105","Blood Draw by Intravenous (IV): Additional tubes",6,null,{"$f":"$C$9*D9","v":0},null,{"$f":"$C$9*F9","v":0},null,{"$f":"$C$9*H9","v":0},null,{"$f":"$C$9*J9","v":0},null,{"$f":"$C$9*L9","v":0},null,{"$f":"$C$9*N9","v":0},null,{"$f":"$C$9*P9","v":0},null,{"$f":"$C$9*R9","v":0},null,{"$f":"$C$9*T9","v":0},null,{"$f":"$C$9*V9","v":0},null,{"$f":"$C$9*X9","v":0},null,0]
["CTU-106","Blood glucose - finger stick",12,null,{"$f":"$C$10*D10","v":0},null,{"$f":"$C$10*F10","v":0},null,{"$f":"$C$10*H10","v":0},null,{"$f":"$C$10*J10","v":0},null,{"$f":"$C$10*L10","v":0},null,{"$f":"$C$10*N10","v":0},null,{"$f":"$C$10*P10","v":0},null,{"$f":"$C$10*R10","v":0},null,{"$f":"$C$10*T10","v":0},null,{"$f":"$C$10*V10","v":0},null,{"$f":"$C$10*X10","v":0},null,0]
["CTU-107","Urine pregnancy",24,null,{"$f":"$C$11*D11","v":0},null,{"$f":"$C$11*F11","v":0},null,{"$f":"$C$11*H11","v":0},null,{"$f":"$C$11*J11","v":0},null,{"$f":"$C$11*L11","v":0},null,{"$f":"$C$11*N11","v":0},null,{"$f":"$C$11*P11","v":0},null,{"$f":"$C$11*R11","v":0},null,{"$f":"$C$11*T11","v":0},null,{"$f":"$C$11*V11","v":0},null,{"$f":"$C$11*X11","v":0},null,0]
["CTU-108","Body fluid collections (urine, stool or sputum)",12,null,{"$f":"$C$12*D12","v":0},null,{"$f":"$C$12*F12","v":0},null,{"$f":"$C$12*H12","v":0},null,{"$f":"$C$12*J12","v":0},null,{"$f":"$C$12*L12","v":0},null,{"$f":"$C$12*N12","v":0},null,{"$f":"$C$12*P12","v":0},null,{"$f":"$C$12*R12","v":0},null,{"$f":"$C$12*T12","v":0},null,{"$f":"$C$12*V12","v":0},null,{"$f":"$C$12*X12","v":0},null,0]
["B. IND/INP/MEDICATION ADMINISTRATION"]
["CTU-201","Oral or Topical",12,null,{"$f":"$C$14*D14","v":0},null,{"$f":"$C$14*F14","v":0},null,{"$f":"$C$14*H14","v":0},null,{"$f":"$C$14*J14","v":0},null,{"$f":"$C$14*L14","v":0},null,{"$f":"$C$14*N14","v":0},null,{"$f":"$C$14*P14","v":0},null,{"$f":"$C$14*R14","v":0},null,{"$f":"$C$14*T14","v":0},null,{"$f":"$C$14*V14","v":0},null,{"$f":"$C$14*X14","v":0},null,{"$f":"SUMPRODUCT(D14:Z14*MOD(COLUMN(D14:Z14)-COLUMN(E14)+1,2))","v":0}]
["CTU-202","Intramuscular (IM) or Subcutaneous (SubQ) Injection",80,null,{"$f":"$C$15*D15","v":0},null,{"$f":"$C$15*F15","v":0},null,{"$f":"$C$15*H15","v":0},null,{"$f":"$C$15*J15","v":0},null,{"$f":"$C$15*L15","v":0},null,{"$f":"$C$15*N15","v":0},null,{"$f":"$C$15*P15","v":0},null,{"$f":"$C$15*R15","v":0},null,{"$f":"$C$15*T15","v":0},null,{"$f":"$C$15*V15","v":0},null,{"$f":"$C$15*X15","v":0},null,{"$f":"SUMPRODUCT(D15:Z15*MOD(COLUMN(D15:Z15)-COLUMN(E15)+1,2))","v":0}]
["CTU-203","Intravenous (IV) Infusion  - Includes IV access, initial set up, drug verification, & initial 60 Min infusion",230,null,{"$f":"$C$16*D16","v":0},null,{"$f":"$C$16*F16","v":0},null,{"$f":"$C$16*H16","v":0},null,{"$f":"$C$16*J16","v":0},null,{"$f":"$C$16*L16","v":0},null,{"$f":"$C$16*N16","v":0},null,{"$f":"$C$16*P16","v":0},null,{"$f":"$C$16*R16","v":0},null,{"$f":"$C$16*T16","v":0},null,{"$f":"$C$16*V16","v":0},null,{"$f":"$C$16*X16","v":0},null,{"$f":"SUMPRODUCT(D16:Z16*MOD(COLUMN(D16:Z16)-COLUMN(E16)+1,2))","v":0}]
["CTU-204","Intravenous (IV) Infusion  -  Additional Infusion Time Needed (30 Min Increments)",58,null,{"$f":"IFERROR(VLOOKUP(D17,'DATA-DO NOT DELETE'!$C$3:$I$22,7,0),0)","v":0},null,{"$f":"IFERROR(VLOOKUP(F17,'DATA-DO NOT DELETE'!$C$3:$I$22,7,0),0)","v":0},null,{"$f":"IFERROR(VLOOKUP(H17,'DATA-DO NOT DELETE'!$C$3:$I$22,7,0),0)","v":0},null,{"$f":"IFERROR(VLOOKUP(J17,'DATA-DO NOT DELETE'!$C$3:$I$22,7,0),0)","v":0},null,{"$f":"IFERROR(VLOOKUP(L17,'DATA-DO NOT DELETE'!$C$3:$I$22,7,0),0)","v":0},null,{"$f":"IFERROR(VLOOKUP(N17,'DATA-DO NOT DELETE'!$C$3:$I$22,7,0),0)","v":0},null,{"$f":"IFERROR(VLOOKUP(P17,'DATA-DO NOT DELETE'!$C$3:$I$22,7,0),0)","v":0},null,{"$f":"IFERROR(VLOOKUP(R17,'DATA-DO NOT DELETE'!$C$3:$I$22,7,0),0)","v":0},null,{"$f":"IFERROR(VLOOKUP(T17,'DATA-DO NOT DELETE'!$C$3:$I$22,7,0),0)","v":0},null,{"$f":"IFERROR(VLOOKUP(V17,'DATA-DO NOT DELETE'!$C$3:$I$22,7,0),0)","v":0},null,{"$f":"IFERROR(VLOOKUP(X17,'DATA-DO NOT DELETE'!$C$3:$I$22,7,0),0)","v":0},null,{"$f":"SUMPRODUCT(D17:Z17*MOD(COLUMN(D17:Z17)-COLUMN(E17)+1,2))","v":0}]
["C, HYDRATION"]
["CTU-301","Pre-Chemotherapy Hydration - Initial 60 Min",144,null,{"$f":"$C$19*D19","v":0},null,{"$f":"$C$19*F19","v":0},null,{"$f":"$C$19*H19","v":0},null,{"$f":"$C$19*J19","v":0},null,{"$f":"$C$19*L19","v":0},null,{"$f":"$C$19*N19","v":0},null,{"$f":"$C$19*P19","v":0},null,{"$f":"$C$19*R19","v":0},null,{"$f":"$C$19*T19","v":0},null,{"$f":"$C$19*V19","v":0},null,{"$f":"$C$19*X19","v":0},null,{"$f":"SUMPRODUCT(D19:Z19*MOD(COLUMN(D19:Z19)-COLUMN(E19)+1,2))","v":0}]
["CTU-302","Pre-Chemotherapy Hydration - Each Additional 30 Min",36,null,{"$f":"IFERROR(VLOOKUP(D20,'DATA-DO NOT DELETE'!$C$3:$E$22,3,0),0)","v":0},null,{"$f":"IFERROR(VLOOKUP(F20,'DATA-DO NOT DELETE'!$C$3:$E$22,3,0),0)","v":0},null,{"$f":"IFERROR(VLOOKUP(H20,'DATA-DO NOT DELETE'!$C$3:$E$22,3,0),0)","v":0},null,{"$f":"IFERROR(VLOOKUP(J20,'DATA-DO NOT DELETE'!$C$3:$E$22,3,0),0)","v":0},null,{"$f":"IFERROR(VLOOKUP(L20,'DATA-DO NOT DELETE'!$C$3:$E$22,3,0),0)","v":0},null,{"$f":"IFERROR(VLOOKUP(N20,'DATA-DO NOT DELETE'!$C$3:$E$22,3,0),0)","v":0},null,{"$f":"IFERROR(VLOOKUP(P20,'DATA-DO NOT DELETE'!$C$3:$E$22,3,0),0)","v":0},null,{"$f":"IFERROR(VLOOKUP(R20,'DATA-DO NOT DELETE'!$C$3:$E$22,3,0),0)","v":0},null,{"$f":"IFERROR(VLOOKUP(T20,'DATA-DO NOT DELETE'!$C$3:$E$22,3,0),0)","v":0},null,{"$f":"IFERROR(VLOOKUP(V20,'DATA-DO NOT DELETE'!$C$3:$E$22,3,0),0)","v":0},null,{"$f":"IFERROR(VLOOKUP(X20,'DATA-DO NOT DELETE'!$C$3:$E$22,3,0),0)","v":0},null,{"$f":"SUMPRODUCT(D20:Z20*MOD(COLUMN(D20:Z20)-COLUMN(E20)+1,2))","v":0}]
["CTU-303","Post-Chemotherapy Hydration - Initial 60 Min",144,null,{"$f":"$C$21*D21","v":0},null,{"$f":"$C$21*F21","v":0},null,{"$f":"$C$21*H21","v":0},null,{"$f":"$C$21*J21","v":0},null,{"$f":"$C$21*L21","v":0},null,{"$f":"$C$21*N21","v":0},null,{"$f":"$C$21*P21","v":0},null,{"$f":"$C$21*R21","v":0},null,{"$f":"$C$21*T21","v":0},null,{"$f":"$C$21*V21","v":0},null,{"$f":"$C$21*X21","v":0},null,{"$f":"SUMPRODUCT(D21:Z21*MOD(COLUMN(D21:Z21)-COLUMN(E21)+1,2))","v":0}]
["CTU-304","Post-Chemotherapy Hydration - Each Additional 30 Min",36,null,{"$f":"IFERROR(VLOOKUP(D22,'DATA-DO NOT DELETE'!$C$3:$E$22,3,0),0)","v":0},null,{"$f":"IFERROR(VLOOKUP(F22,'DATA-DO NOT DELETE'!$C$3:$E$22,3,0),0)","v":0},null,{"$f":"IFERROR(VLOOKUP(H22,'DATA-DO NOT DELETE'!$C$3:$E$22,3,0),0)","v":0},null,{"$f":"IFERROR(VLOOKUP(J22,'DATA-DO NOT DELETE'!$C$3:$E$22,3,0),0)","v":0},null,{"$f":"IFERROR(VLOOKUP(L22,'DATA-DO NOT DELETE'!$C$3:$E$22,3,0),0)","v":0},null,{"$f":"IFERROR(VLOOKUP(N22,'DATA-DO NOT DELETE'!$C$3:$E$22,3,0),0)","v":0},null,{"$f":"IFERROR(VLOOKUP(P22,'DATA-DO NOT DELETE'!$C$3:$E$22,3,0),0)","v":0},null,{"$f":"IFERROR(VLOOKUP(R22,'DATA-DO NOT DELETE'!$C$3:$E$22,3,0),0)","v":0},null,{"$f":"IFERROR(VLOOKUP(T22,'DATA-DO NOT DELETE'!$C$3:$E$22,3,0),0)","v":0},null,{"$f":"IFERROR(VLOOKUP(V22,'DATA-DO NOT DELETE'!$C$3:$E$22,3,0),0)","v":0},null,{"$f":"IFERROR(VLOOKUP(X22,'DATA-DO NOT DELETE'!$C$3:$E$22,3,0),0)","v":0},null,{"$f":"SUMPRODUCT(D22:Z22*MOD(COLUMN(D22:Z22)-COLUMN(E22)+1,2))","v":0}]
["D,  OBSERVATION/EDUCATION (NO BLOOD DRAW)"]
["CTU-401","Patient Observation, Education and Training  (30 Min Increments)",54,null,{"$f":"IFERROR(VLOOKUP(D24,'DATA-DO NOT DELETE'!$C$3:$G$22,5,0),0)","v":0},null,{"$f":"IFERROR(VLOOKUP(F24,'DATA-DO NOT DELETE'!$C$3:$G$22,5,0),0)","v":0},null,{"$f":"IFERROR(VLOOKUP(H24,'DATA-DO NOT DELETE'!$C$3:$G$22,5,0),0)","v":0},null,{"$f":"IFERROR(VLOOKUP(J24,'DATA-DO NOT DELETE'!$C$3:$G$22,5,0),0)","v":0},null,{"$f":"IFERROR(VLOOKUP(L24,'DATA-DO NOT DELETE'!$C$3:$G$22,5,0),0)","v":0},null,{"$f":"IFERROR(VLOOKUP(N24,'DATA-DO NOT DELETE'!$C$3:$G$22,5,0),0)","v":0},null,{"$f":"IFERROR(VLOOKUP(P24,'DATA-DO NOT DELETE'!$C$3:$G$22,5,0),0)","v":0},null,{"$f":"IFERROR(VLOOKUP(R24,'DATA-DO NOT DELETE'!$C$3:$G$22,5,0),0)","v":0},null,{"$f":"IFERROR(VLOOKUP(T24,'DATA-DO NOT DELETE'!$C$3:$G$22,5,0),0)","v":0},null,{"$f":"IFERROR(VLOOKUP(V24,'DATA-DO NOT DELETE'!$C$3:$G$22,5,0),0)","v":0},null,{"$f":"IFERROR(VLOOKUP(X24,'DATA-DO NOT DELETE'!$C$3:$G$22,5,0),0)","v":0},null,{"$f":"SUMPRODUCT(D24:Z24*MOD(COLUMN(D24:Z24)-COLUMN(E24)+1,2))","v":0}]
["E. EKG & CARDIAC MONITORING"]
["CTU-501","Single EKG (12 lead): No interpretation \n",91.68,null,{"$f":"$C$26*D26","v":0},null,{"$f":"$C$26*F26","v":0},null,{"$f":"$C$26*H26","v":0},null,{"$f":"$C$26*J26","v":0},null,{"$f":"$C$26*L26","v":0},null,{"$f":"$C$26*N26","v":0},null,{"$f":"$C$26*P26","v":0},null,{"$f":"$C$26*R26","v":0},null,{"$f":"$C$26*T26","v":0},null,{"$f":"$C$26*V26","v":0},null,{"$f":"$C$26*X26","v":0},null,{"$f":"SUMPRODUCT(D26:Z26*MOD(COLUMN(D26:Z26)-COLUMN(E26)+1,2))","v":0}]
["CTU-502","Triplicate EKG (12 lead): Set of three EKGs, No interpretation ",275.04000000000002,null,{"$f":"$C$27*D27","v":0},null,{"$f":"$C$27*F27","v":0},null,{"$f":"$C$27*H27","v":0},null,{"$f":"$C$27*J27","v":0},null,{"$f":"$C$27*L27","v":0},null,{"$f":"$C$27*N27","v":0},null,{"$f":"$C$27*P27","v":0},null,{"$f":"$C$27*R27","v":0},null,{"$f":"$C$27*T27","v":0},null,{"$f":"$C$27*V27","v":0},null,{"$f":"$C$27*X27","v":0},null,{"$f":"SUMPRODUCT(D27:Z27*MOD(COLUMN(D27:Z27)-COLUMN(E27)+1,2))","v":0}]
["CTU-503","Cardiac Monitoring, No interpretation",144,null,{"$f":"$C$28*D28","v":0},null,{"$f":"$C$28*F28","v":0},null,{"$f":"$C$28*H28","v":0},null,{"$f":"$C$28*J28","v":0},null,{"$f":"$C$28*L28","v":0},null,{"$f":"$C$28*N28","v":0},null,{"$f":"$C$28*P28","v":0},null,{"$f":"$C$28*R28","v":0},null,{"$f":"$C$28*T28","v":0},null,{"$f":"$C$28*V28","v":0},null,{"$f":"$C$28*X28","v":0},null,{"$f":"SUMPRODUCT(D28:Z28*MOD(COLUMN(D28:Z28)-COLUMN(E28)+1,2))","v":0}]
["CTU-504","Holter Monitor (hook up, recording and disconnection)",72,null,{"$f":"$C$29*D29","v":0},null,{"$f":"$C$29*F29","v":0},null,{"$f":"$C$29*H29","v":0},null,{"$f":"$C$29*J29","v":0},null,{"$f":"$C$29*L29","v":0},null,{"$f":"$C$29*N29","v":0},null,{"$f":"$C$29*P29","v":0},null,{"$f":"$C$29*R29","v":0},null,{"$f":"$C$29*T29","v":0},null,{"$f":"$C$29*V29","v":0},null,{"$f":"$C$29*X29","v":0},null,{"$f":"SUMPRODUCT(D29:Z29*MOD(COLUMN(D29:Z29)-COLUMN(E29)+1,2))","v":0}]
["F. CTU BODY COMPOSITION SERVICES"]
["CTU-601","DEXA whole body composition, hip,  & spine (combined)",190,null,{"$f":"$C$31*D31","v":0},null,{"$f":"$C$31*F31","v":0},null,{"$f":"$C$31*H31","v":0},null,{"$f":"$C$31*J31","v":0},null,{"$f":"$C$31*L31","v":0},null,{"$f":"$C$31*N31","v":0},null,{"$f":"$C$31*P31","v":0},null,{"$f":"$C$31*R31","v":0},null,{"$f":"$C$31*T31","v":0},null,{"$f":"$C$31*V31","v":0},null,{"$f":"$C$31*X31","v":0},null,{"$f":"SUMPRODUCT(D31:Z31*MOD(COLUMN(D31:Z31)-COLUMN(E31)+1,2))","v":0}]
["CTU-602","DEXA whole body (composition)",150,null,{"$f":"$C$32*D32","v":0},null,{"$f":"$C$32*F32","v":0},null,{"$f":"$C$32*H32","v":0},null,{"$f":"$C$32*J32","v":0},null,{"$f":"$C$32*L32","v":0},null,{"$f":"$C$32*N32","v":0},null,{"$f":"$C$32*P32","v":0},null,{"$f":"$C$32*R32","v":0},null,{"$f":"$C$32*T32","v":0},null,{"$f":"$C$32*V32","v":0},null,{"$f":"$C$32*X32","v":0},null,0]
["CTU-603","DEXA bone density (spine)",75,null,{"$f":"$C$33*D33","v":0},null,{"$f":"$C$33*F33","v":0},null,{"$f":"$C$33*H33","v":0},null,{"$f":"$C$33*J33","v":0},null,{"$f":"$C$33*L33","v":0},null,{"$f":"$C$33*N33","v":0},null,{"$f":"$C$33*P33","v":0},null,{"$f":"$C$33*R33","v":0},null,{"$f":"$C$33*T33","v":0},null,{"$f":"$C$33*V33","v":0},null,{"$f":"$C$33*X33","v":0},null,0]
["CTU-604","DEXA bone density (hip)",75,null,{"$f":"$C$34*D34","v":0},null,{"$f":"$C$34*F34","v":0},null,{"$f":"$C$34*H34","v":0},null,{"$f":"$C$34*J34","v":0},null,{"$f":"$C$34*L34","v":0},null,{"$f":"$C$34*N34","v":0},null,{"$f":"$C$34*P34","v":0},null,{"$f":"$C$34*R34","v":0},null,{"$f":"$C$34*T34","v":0},null,{"$f":"$C$34*V34","v":0},null,{"$f":"$C$34*X34","v":0},null,0]
["CTU-605","DEXA Data Processing",40,null,{"$f":"$C$35*D35","v":0},null,{"$f":"$C$35*F35","v":0},null,{"$f":"$C$35*H35","v":0},null,{"$f":"$C$35*J35","v":0},null,{"$f":"$C$35*L35","v":0},null,{"$f":"$C$35*N35","v":0},null,{"$f":"$C$35*P35","v":0},null,{"$f":"$C$35*R35","v":0},null,{"$f":"$C$35*T35","v":0},null,{"$f":"$C$35*V35","v":0},null,{"$f":"$C$35*X35","v":0},null,0]
["CTU-606","DEXA Phantom scan for multisite study",40,null,{"$f":"$C$36*D36","v":0},null,{"$f":"$C$36*F36","v":0},null,{"$f":"$C$36*H36","v":0},null,{"$f":"$C$36*J36","v":0},null,{"$f":"$C$36*L36","v":0},null,{"$f":"$C$36*N36","v":0},null,{"$f":"$C$36*P36","v":0},null,{"$f":"$C$36*R36","v":0},null,{"$f":"$C$36*T36","v":0},null,{"$f":"$C$36*V36","v":0},null,{"$f":"$C$36*X36","v":0},null,0]
["CTU-606","Waist-hip circumference ",12,null,{"$f":"$C$37*D37","v":0},null,{"$f":"$C$37*F37","v":0},null,{"$f":"$C$37*H37","v":0},null,{"$f":"$C$37*J37","v":0},null,{"$f":"$C$37*L37","v":0},null,{"$f":"$C$37*N37","v":0},null,{"$f":"$C$37*P37","v":0},null,{"$f":"$C$37*R37","v":0},null,{"$f":"$C$37*T37","v":0},null,{"$f":"$C$37*V37","v":0},null,{"$f":"$C$37*X37","v":0},null,0]
["CTU-608","Skinfold measurement (per site)",20,null,{"$f":"$C$38*D38","v":0},null,{"$f":"$C$38*F38","v":0},null,{"$f":"$C$38*H38","v":0},null,{"$f":"$C$38*J38","v":0},null,{"$f":"$C$38*L38","v":0},null,{"$f":"$C$38*N38","v":0},null,{"$f":"$C$38*P38","v":0},null,{"$f":"$C$38*R38","v":0},null,{"$f":"$C$38*T38","v":0},null,{"$f":"$C$38*V38","v":0},null,{"$f":"$C$38*X38","v":0},null,0]
["CTU-609","Other: Please contact CTU",null,null,{"$f":"$C$39*D39","v":0},null,{"$f":"$C$39*F39","v":0},null,{"$f":"$C$39*H39","v":0},null,{"$f":"$C$39*J39","v":0},null,{"$f":"$C$39*L39","v":0},null,{"$f":"$C$39*N39","v":0},null,{"$f":"$C$39*P39","v":0},null,{"$f":"$C$39*R39","v":0},null,{"$f":"$C$39*T39","v":0},null,{"$f":"$C$39*V39","v":0},null,{"$f":"$C$39*X39","v":0},null,0]
["G. SAMPLE PROCESSING - TO BE COMPLETED BY CTU TEAM"]
{"$rows_left_out":43}
{"sheet":"DATA-DO NOT DELETE","index":2,"n_rows":60,"n_cols":19,"rows_kept":60,"cut":false,"hidden":true,"merged":[]}
["Qty",null,"Frequency","Price",null,null,null,null,null,null,"Type of Study",null,null,"Frequency","Price",null,null,null,"Department Name"]
[1,1,0,0,0,0,null,null,null,null,"Industry",2350,null,0,0,0,null,null,"Anesthesiology"]
[2,2,30,36,{"$f":"ROUND(D3,0)","v":36},54,{"$f":"ROUND(F3,0)","v":54},58,{"$f":"ROUND(H3,0)","v":58},null,"Non-Industry",0,null,30,72,{"$f":"ROUND(O3,0)","v":72},null,null,"Biochemistry & Molecular Medicine"]
[3,3,60,{"$f":"$D$3*A3","v":72},{"$f":"ROUND(D4,0)","v":72},{"$f":"$F$3*A3","v":108},{"$f":"ROUND(F4,0)","v":108},{"$f":"$H$3*A3","v":116},{"$f":"ROUND(H4,0)","v":116},null,"Industry Lab Only",250,null,60,{"$f":"$O$3*A3","v":144},{"$f":"ROUND(O4,0)","v":144},null,null,"Cancer Center"]
[4,4,90,{"$f":"$D$3*A4","v":108},108,{"$f":"$F$3*A4","v":162},162,{"$f":"$H$3*A4","v":174},174,null,"Industry Amend",0,null,90,{"$f":"$O$3*A4","v":216},216,null,null,"Cardiothoracic Surgery"]
[5,5,120,144,144,{"$f":"$F$3*A5","v":216},216,{"$f":"$H$3*A5","v":232},232,null,null,null,null,120,{"$f":"$O$3*A5","v":288},288,null,null,"Cell & Neurobiology"]
[6,6,150,180,180,270,270,{"$f":"$H$3*A6","v":290},290,null,null,null,null,150,360,360,null,null,"Center for Genetic Epidemiology"]
[7,7,180,216,216,324,324,{"$f":"$H$3*A7","v":348},348,null,"Lab Only:","Yes",null,180,432,432,null,null,"Center for Stem Cell and Regenerative Medicine"]
[8,8,210,252,252,378,378,406,406,null,"Lab Only:","No",null,210,504,504,null,null,"Colorectal Surgery"]
[9,9,240,288,288,432,432,464,464,null,null,null,null,240,576,576,null,null,"Dentistry"]
[10,10,270,324,324,486,486,522,522,null,null,null,null,270,648,648,null,null,"Dermatology"]
[11,11,300,360,360,540,540,580,580,null,"Amendment","Yes",null,300,720,720,null,null,"Dornsife"]
[12,12,330,396,396,594,594,638,638,null,"Amendment","No",null,330,792,792,null,null,"Emergency Medicine"]
[13,13,360,432,432,648,648,696,696,null,null,null,null,360,864,864,null,null,"Emergency Medicine - Global Emergency Medicine"]
[14,14,390,468,468,702,702,754,754,null,null,null,null,390,936,936,null,null,"Emergency Medicine - Pediatric Emergency Medicine"]
[15,15,420,{"$f":"$D$3*A15","v":504},504,756,756,812,812,null,null,null,null,420,1008,1008,null,null,"Emergency Medicine - Toxicology"]
[16,16,450,540,540,810,810,870,870,null,null,null,null,450,1080,1080,null,null,"Family Medicine"]
[17,17,480,576,576,864,864,928,928,null,null,null,null,480,1152,1152,null,null,"Gerontology"]
[18,18,510,612,612,918,918,986,986,null,null,null,null,510,1224,1224,null,null,"Institute for Genetic Medicine"]
[19,19,540,648,648,972,972,1044,1044,null,null,null,null,540,1296,1296,null,null,"Integrative Anatomical Sciences"]
[20,20,570,684,684,1026,1026,1102,1102,null,null,null,null,570,1368,1368,null,null,"Medicine - Cardiovascular Medicine"]
[21,21,600,720,720,1080,1080,1160,1160,null,null,null,null,600,1440,1440,null,null,"Medicine - Endocrinology & Diabetes"]
[null,22,null,null,null,null,null,null,null,null,null,null,null,null,null,null,null,null,"Medicine - Gastrointestinal and Liver Diseases"]
[null,23,null,null,null,null,null,null,null,null,null,null,null,null,null,null,null,null,"Medicine - Geriatric, Hospital, Palliative and General Internal Medicine"]
[null,24,null,null,null,null,null,null,null,null,null,null,null,null,null,null,null,null,"Medicine - Hematology"]
[null,25,null,null,null,null,null,null,null,null,null,null,null,null,null,null,null,null,"Medicine - Infectious Diseases"]
[null,26,null,null,null,null,null,null,null,null,null,null,null,null,null,null,null,null,"Medicine - Nephrology and Hypertension"]
[null,27,null,null,null,null,null,null,null,null,null,null,null,null,null,null,null,null,"Medicine - Oncology"]
[null,28,null,null,null,null,null,null,null,null,null,null,null,null,null,null,null,null,"Medicine - Pulmonary, Critical Care and Sleep Medicine"]
[null,29,null,null,null,null,null,null,null,null,null,null,null,null,null,null,null,null,"Medicine - Rheumatology"]
[null,30,null,null,null,null,null,null,null,null,null,null,null,null,null,null,null,null,"Molecular Microbiology and Immunology"]
[null,31,null,null,null,null,null,null,null,null,null,null,null,null,null,null,null,null,"Neuroimaging and Informatics Insitute"]
[null,32,null,null,null,null,null,null,null,null,null,null,null,null,null,null,null,null,"Neurological Surgery"]
[null,33,null,null,null,null,null,null,null,null,null,null,null,null,null,null,null,null,"Neurology"]
[null,34,null,null,null,null,null,null,null,null,null,null,null,null,null,null,null,null,"Obstetrics/Gynecology"]
[null,35,null,null,null,null,null,null,null,null,null,null,null,null,null,null,null,null,"Occupational Therapy"]
[null,36,null,null,null,null,null,null,null,null,null,null,null,null,null,null,null,null,"Ophthalmology"]
[null,37,null,null,null,null,null,null,null,null,null,null,null,null,null,null,null,null,"Orthopaedics"]
[null,38,null,null,null,null,null,null,null,null,null,null,null,null,null,null,null,null,"Otolaryngology"]
[null,39,null,null,null,null,null,null,null,null,null,null,null,null,null,null,null,null,"Pathology"]
{"$rows_left_out":20}